Target
3 beta-hydroxysteroid dehydrogenase/Delta 5-->4-isomerase
Ligand
BDBM50340465
Substrate
Meas. Tech.
ChEMBL_741233 (CHEMBL1764602)
IC50
>200000±n/a nM
Citation
 Thomas, STYang, XSampson, NS Inhibition of the M. tuberculosis 3β-hydroxysteroid dehydrogenase by azasteroids. Bioorg Med Chem Lett 21:2216-9 (2011)  
Target
Name:
3 beta-hydroxysteroid dehydrogenase/Delta 5-->4-isomerase
Synonyms:
3BHS_MYCTU
Type:
PROTEIN
Mol. Mass.:
40743.62
Organism:
Mycobacterium tuberculosis
Description:
ChEMBL_741233
Residue:
370
  
Inhibitor
Name:
BDBM50340465
Synonyms:
(1S,3aS,3bS,9aR,9bS,11aS)-9a,11a-dimethyl-7-oxo-2,3,3a,3b,4,5,7,8,9,9a,9b,10,11,11a-tetradecahydro-1H-cyclopenta[i]phenanthridine-1-carboxylic acid | CHEMBL1762022
Type:
Small organic molecule
Emp. Form.:
C19H27NO3
Mol. Mass.:
317.4226
SMILES:
C[C@]12CC[C@H]3[C@@H](CN=C4CC(=O)CC[C@]34C)[C@@H]1CC[C@@H]2C(O)=O
: