Target
3 beta-hydroxysteroid dehydrogenase/Delta 5-->4-isomerase
Ligand
BDBM50340483
Substrate
Meas. Tech.
ChEMBL_741233 (CHEMBL1764602)
IC50
540000±n/a nM
Citation
 Thomas, STYang, XSampson, NS Inhibition of the M. tuberculosis 3β-hydroxysteroid dehydrogenase by azasteroids. Bioorg Med Chem Lett 21:2216-9 (2011)  
Target
Name:
3 beta-hydroxysteroid dehydrogenase/Delta 5-->4-isomerase
Synonyms:
3BHS_MYCTU
Type:
PROTEIN
Mol. Mass.:
40743.62
Organism:
Mycobacterium tuberculosis
Description:
ChEMBL_741233
Residue:
370
  
Inhibitor
Name:
BDBM50340483
Synonyms:
(1S,3aS,3bS,8bS,8cS,10aS)-N,N-diethyl-8b,10a-dimethyl-7-oxo-1,2,3,3a,3b,4,5,7,7a,8,8a,8b,8c,9,10,10a-hexadecahydrocyclopenta[i]cyclopropa[a]phenanthridine-1-carboxamide | CHEMBL1762039
Type:
Small organic molecule
Emp. Form.:
C24H36N2O2
Mol. Mass.:
384.5548
SMILES:
CCN(CC)C(=O)[C@H]1CC[C@H]2[C@@H]3CN=C4CC(=O)C5CC5[C@]4(C)[C@H]3CC[C@]12C
: