Target
Tyrosinase
Ligand
BDBM50340789
Substrate
Meas. Tech.
ChEMBL_740266 (CHEMBL1764166)
IC50
830±n/a nM
Citation
 Tajima, ROozeki, HMuraoka, STanaka, SMotegi, YNihei, HYamada, YMasuoka, NNihei, K Synthesis and evaluation of bibenzyl glycosides as potent tyrosinase inhibitors. Eur J Med Chem 46:1374-81 (2011)  
Target
Name:
Tyrosinase
Synonyms:
LB24-AB SK29-AB TYRO_HUMAN | Tumor rejection antigen AB
Type:
Protein
Mol. Mass.:
60388.08
Organism:
Homo sapiens (Human)
Description:
P14679
Residue:
529
  
Inhibitor
Name:
BDBM50340789
Synonyms:
2,2',4'-Trihydroxy-4-(beta-D-maltopyranosyl)bibenzyl | CHEMBL1760464
Type:
Small organic molecule
Emp. Form.:
C26H34O14
Mol. Mass.:
570.5398
SMILES:
OC[C@H]1O[C@H](O[C@H]2[C@H](O)[C@@H](O)[C@H](Oc3ccc(CCc4ccc(O)cc4O)c(O)c3)O[C@@H]2CO)[C@H](O)[C@@H](O)[C@@H]1O
: