Target
Adenosine receptor A2b
Ligand
BDBM50341191
Substrate
Meas. Tech.
ChEMBL_740586 (CHEMBL1764849)
IC50
8±n/a nM
Citation
 Firooznia, FCheung, AWBrinkman, JGrimsby, JGubler, MLHamid, RMarcopulos, NRamsey, GTan, JWen, YSarabu, R Discovery of benzothiazole-based adenosine A2B receptor antagonists with improved A2A selectivity. Bioorg Med Chem Lett 21:1933-6 (2011)  
Target
Name:
Adenosine receptor A2b
Synonyms:
AA2BR_HUMAN ADORA2B Adenosine receptors A2b | Adenosine receptors; A2a & A2b
Type:
G Protein-Coupled Receptor (GPCR)
Mol. Mass.:
36341.22
Organism:
Homo sapiens (Human)
Description:
Residue:
332
  
Inhibitor
Name:
BDBM50341191
Synonyms:
CHEMBL1760888 | cis-N-((1S,3R)-3-(7-(N-ethylacetamido)-4-methoxybenzo[d]thiazol-2-ylcarbamoyl)cyclopentyl)-3-(trifluoromethyl)benzamide
Type:
Small organic molecule
Emp. Form.:
C26H27F3N4O4S
Mol. Mass.:
548.577
SMILES:
CCN(C(C)=O)c1ccc(OC)c2nc(NC(=O)[C@@H]3CC[C@@H](C3)NC(=O)c3cccc(c3)C(F)(F)F)sc12
: