Target
Alpha-galactosidase
Ligand
BDBM50318560
Substrate
Meas. Tech.
ChEMBL_742387 (CHEMBL1768945)
IC50
>100000±n/a nM
Citation
 Díaz, LCasas, JBujons, JLlebaria, ADelgado, A New glucocerebrosidase inhibitors by exploration of chemical diversity of N-substituted aminocyclitols using click chemistry and in situ screening. J Med Chem 54:2069-79 (2011)  
Target
Name:
Alpha-galactosidase
Synonyms:
α-galactosidase Alpha-galactosidase
Type:
Protein
Mol. Mass.:
41306.82
Organism:
Coffea arabica (Coffee beans)
Description:
Residue:
378
  
Inhibitor
Name:
BDBM50318560
Synonyms:
CHEMBL1083795 | N-decylaminocyclitol
Type:
Small organic molecule
Emp. Form.:
C16H33NO5
Mol. Mass.:
319.4369
SMILES:
CCCCCCCCCCN[C@@H]1[C@@H](O)[C@H](O)[C@@H](O)[C@H](O)[C@H]1O
: