Target
Protein-glutamine gamma-glutamyltransferase 2
Ligand
BDBM50342574
Substrate
Meas. Tech.
ChEMBL_744966 (CHEMBL1771981)
IC50
>250000±n/a nM
Citation
 Klöck, CJin, XChoi, KKhosla, CMadrid, PBSpencer, ARaimundo, BCBoardman, PLanza, GGriffin, JH Acylideneoxoindoles: a new class of reversible inhibitors of human transglutaminase 2. Bioorg Med Chem Lett 21:2692-6 (2011)  
Target
Name:
Protein-glutamine gamma-glutamyltransferase 2
Synonyms:
Protein-glutamine gamma-glutamyltransferase TGM2 Tissue transglutaminase Transglutaminase 2 (TGM2) Transglutaminase-2
Type:
Protein
Mol. Mass.:
77309.30
Organism:
Homo sapiens (Human)
Description:
P21980
Residue:
687
  
Inhibitor
Name:
BDBM50342574
Synonyms:
1,1'-(2,5-dimethyl-1,4-phenylene)bis(methylene)diindoline-2,3-dione | CHEMBL1770392
Type:
Small organic molecule
Emp. Form.:
C26H20N2O4
Mol. Mass.:
424.448
SMILES:
Cc1cc(CN2C(=O)C(=O)c3ccccc23)c(C)cc1CN1C(=O)C(=O)c2ccccc12
: