Target
Neuropeptide Y receptor type 1
Ligand
BDBM50342727
Substrate
Meas. Tech.
ChEMBL_744205 (CHEMBL1771962)
Ki
8±n/a nM
Citation
 Griffith, DAHargrove, DMMaurer, TSBlum, CADe Lombaert, SInthavongsay, JKKlade, LEMack, CMRose, CRSanders, MJCarpino, PA Discovery and evaluation of pyrazolo[1,5-a]pyrimidines as neuropeptide Y1 receptor antagonists. Bioorg Med Chem Lett 21:2641-5 (2011)  
Target
Name:
Neuropeptide Y receptor type 1
Synonyms:
NPY-Y1 NPY1R NPYR neuropeptide Y receptor Y1
Type:
Enzyme Catalytic Domain
Mol. Mass.:
44399.07
Organism:
Homo sapiens (Human)
Description:
NPY-Y1 NPY1R HUMAN::P25929
Residue:
384
  
Inhibitor
Name:
BDBM50342727
Synonyms:
CHEMBL1771261 | N1-(3-(2,6-dichloro-4-propoxyphenyl)-2,5-dimethylpyrazolo[1,5-a]pyrimidin-7-yl)-N2-(tetrahydro-2H-pyran-4-yl)ethane-1,2-diamine
Type:
Small organic molecule
Emp. Form.:
C24H31Cl2N5O2
Mol. Mass.:
492.441
SMILES:
CCCOc1cc(Cl)c(-c2c(C)nn3c(NCCNC4CCOCC4)cc(C)nc23)c(Cl)c1
: