Target
Uracil-DNA glycosylase
Ligand
BDBM50343412
Substrate
Meas. Tech.
ChEMBL_747132 (CHEMBL1777498)
IC50
91200±n/a nM
Citation
 Nuth, MHuang, LSaw, YLSchormann, NChattopadhyay, DRicciardi, RP Identification of inhibitors that block vaccinia virus infection by targeting the DNA synthesis processivity factor D4. J Med Chem 54:3260-7 (2011)  
Target
Name:
Uracil-DNA glycosylase
Synonyms:
OPG116 UNG | UNG_VACCW
Type:
PROTEIN
Mol. Mass.:
25071.48
Organism:
Vaccinia virus (strain Western Reserve) (VACV) (Vaccinia virus (strainWR))
Description:
ChEMBL_747132
Residue:
218
  
Inhibitor
Name:
BDBM50343412
Synonyms:
4-[5-(4-bromophenyl)-4-phenyl-1H-imidazol-2-yl]-2,6-dimethoxyphenol | CHEMBL1406781
Type:
Small organic molecule
Emp. Form.:
C23H19BrN2O3
Mol. Mass.:
451.313
SMILES:
COc1cc(cc(OC)c1O)-c1nc(c([nH]1)-c1ccc(Br)cc1)-c1ccccc1
: