Target
Replicase polyprotein 1ab
Ligand
BDBM50343551
Substrate
Meas. Tech.
ChEMBL_747086 (CHEMBL1777452)
IC50
58350±n/a nM
Citation
 Nguyen, TTRyu, HJLee, SHHwang, SBreton, VRhee, JHKim, D Virtual screening identification of novel severe acute respiratory syndrome 3C-like protease inhibitors and in vitro confirmation. Bioorg Med Chem Lett 21:3088-91 (2011)  
Target
Name:
Replicase polyprotein 1ab
Synonyms:
3C-like proteinase 3C-like proteinase (SARS-CoV 3Cpro) 3CLp GFL Guanine-N7 methyltransferase Helicase Leader protein Non-structural protein 10 Non-structural protein 3 Non-structural protein 6 Non-structural protein 8 ORF1ab polyprotein PL2-PRO Pol R1AB_SARS RdRp SARS coronavirus main proteinase nsp1 nsp12 nsp14 nsp16 nsp3 nsp5 nsp7 nsp9 pp1ab | rep
Type:
Protein
Mol. Mass.:
790250.81
Organism:
Human SARS coronavirus (SARS-CoV) (Severe acute respiratory syndrome coronavirus)
Description:
P0C6X7
Residue:
7073
  
Inhibitor
Name:
BDBM50343551
Synonyms:
4-({[5-(1-naphthyl)-4-phenyl-4H-1,2,4-triazol-3-yl]thio}methyl)-1,3-thiazol-2-amine acs.jmedchem.1c00409_ST.716
Type:
Small organic molecule
Emp. Form.:
C22H17N5S2
Mol. Mass.:
415.534
SMILES:
Nc1nc(CSc2nnc(-c3cccc4ccccc34)n2-c2ccccc2)cs1
: