Target
Disintegrin and metalloproteinase domain-containing protein 17
Ligand
BDBM50343977
Substrate
Meas. Tech.
ChEMBL_748329 (CHEMBL1781453)
Ki
0.200000±n/a nM
Citation
 Li, DPopovici-Muller, JBelanger, DBCaldwell, JDai, CDavid, MGirijavallabhan, VMLavey, BJLee, JFLiu, ZMazzola, RRizvi, RRosner, KEShankar, BSpitler, JTing, PCVaccaro, HYu, WZhou, GZhu, ZNiu, XSun, JGuo, ZOrth, PChen, SKozlowski, JALundell, DJMadison, VMcKittrick, BPiwinski, JJShih, NYShipps, GWSiddiqui, MAStrickland, CO Structure and activity relationships of tartrate-based TACE inhibitors. Bioorg Med Chem Lett 20:4812-5 (2010)  
Target
Name:
Disintegrin and metalloproteinase domain-containing protein 17
Synonyms:
ADA17_HUMAN CSVP Disintegrin and metalloproteinase domain-containing protein 17 (ADAM17) TNF-alpha convertase TNF-alpha-converting enzyme (TACE) Tumor necrosis factor-α converting enzyme (TACE)
Type:
Enzyme
Mol. Mass.:
93007.89
Organism:
Homo sapiens (Human)
Description:
Residue:
824
  
Inhibitor
Name:
BDBM50343977
Synonyms:
(2R,3R)-2,3-dihydroxy-4-(isoindolin-2-yl)-4-oxo-N-((5-((2-(trifluoromethyl)-1H-benzo[d]imidazol-1-yl)methyl)thiophen-2-yl)methyl)butanamide | CHEMBL1779610
Type:
Small organic molecule
Emp. Form.:
C26H23F3N4O4S
Mol. Mass.:
544.545
SMILES:
O[C@H]([C@@H](O)C(=O)N1Cc2ccccc2C1)C(=O)NCc1ccc(Cn2c(nc3ccccc23)C(F)(F)F)s1
: