Target
Muscarinic acetylcholine receptor M1
Ligand
BDBM50344269
Substrate
Meas. Tech.
ChEMBL_748302 (CHEMBL1781312)
IC50
1±n/a nM
Citation
 Prat, MBuil, MAFernández, MDCastro, JMonleón, JMTort, LCasals, GFerrer, MHuerta, JMEspinosa, SLópez, MSegarra, VGavaldà, AMiralpeix, MRamos, IVilella, DGonzález, MCórdoba, MCárdenas, AAntón, FBeleta, JRyder, H Discovery of novel quaternary ammonium derivatives of (3R)-quinuclidinyl carbamates as potent and long acting muscarinic antagonists. Bioorg Med Chem Lett 21:3457-61 (2011)  
Target
Name:
Muscarinic acetylcholine receptor M1
Synonyms:
ACM1_HUMAN Cholinergic receptor, muscarinic 1 | Cholinergic, muscarinic M1
Type:
Protein
Mol. Mass.:
51442.54
Organism:
Homo sapiens (Human)
Description:
P11229
Residue:
460
  
Inhibitor
Name:
BDBM50344269
Synonyms:
(R)-quinuclidin-3-yl phenethyl(phenyl)carbamate | CHEMBL1779032
Type:
Small organic molecule
Emp. Form.:
C22H26N2O2
Mol. Mass.:
350.454
SMILES:
O=C(O[C@H]1CN2CCC1CC2)N(CCc1ccccc1)c1ccccc1
: