Target
Aromatase
Ligand
BDBM9460
Substrate
Meas. Tech.
ChEMBL_751246 (CHEMBL1787614)
IC50
5800±n/a nM
Citation
 Yahiaoui, SPouget, CBuxeraud, JChulia, AJFagnère, C Lead optimization of 4-imidazolylflavans: new promising aromatase inhibitors. Eur J Med Chem 46:2541-5 (2011)  
Target
Name:
Aromatase
Synonyms:
ARO1 CP19A_HUMAN CYP19 CYPXIX Cytochrome P450 19A1 Cytochrome P450-C19 (CYP19) FL cytokine receptor precursor | P-450AROM
Type:
Enzyme
Mol. Mass.:
57888.92
Organism:
Homo sapiens (Human)
Description:
P11511
Residue:
503
  
Inhibitor
Name:
BDBM9460
Synonyms:
3-(4-aminophenyl)-3-ethyl-piperidine-2,6-dione Aminoglutethimide AG, 4 Cytadren Elipten | aminoglutethimide (AG)
Type:
Small organic molecule
Emp. Form.:
C13H16N2O2
Mol. Mass.:
232.2783
SMILES:
CCC1(CCC(=O)NC1=O)c1ccc(N)cc1
: