Target
Glyceraldehyde-3-phosphate dehydrogenase, glycosomal
Ligand
BDBM50292429
Substrate
Meas. Tech.
ChEMBL_749309 (CHEMBL1785090)
Ki
2000±n/a nM
Citation
 Pereira, JMSeverino, RPVieira, PCFernandes, JBda Silva, MFZottis, AAndricopulo, ADOliva, GCorrêa, AG Anacardic acid derivatives as inhibitors of glyceraldehyde-3-phosphate dehydrogenase from Trypanosoma cruzi. Bioorg Med Chem 16:8889-95 (2008)  
Target
Name:
Glyceraldehyde-3-phosphate dehydrogenase, glycosomal
Synonyms:
G3PG_TRYCR
Type:
PROTEIN
Mol. Mass.:
39070.68
Organism:
Trypanosoma cruzi
Description:
ChEMBL_973242
Residue:
359
  
Inhibitor
Name:
BDBM50292429
Synonyms:
2-Hydroxy-6-pentadecyl-benzoic acid 2-hydroxy-6-((8Z,11Z)-pentadeca-8,11,14-trienyl)benzoic acid 6-[8(Z),11(Z),14-pentadecatrienyl]salicylic acid 6-pentadecylsalicylic acid 6[8'(Z ),11'(Z ),14'-pentadecatrienyl]salicylicacid CHEMBL455368 | anacardic acid
Type:
Small organic molecule
Emp. Form.:
C22H30O3
Mol. Mass.:
342.4718
SMILES:
OC(=O)c1c(O)cccc1CCCCCCC\C=C/C\C=C/CC=C
: