Target
Hypoxia-inducible factor 1-alpha inhibitor
Ligand
BDBM26108
Substrate
Meas. Tech.
ChEMBL_754093 (CHEMBL1798571)
Ki
83000±n/a nM
Citation
 Lohse, BKristensen, JLKristensen, LHAgger, KHelin, KGajhede, MClausen, RP Inhibitors of histone demethylases. Bioorg Med Chem 19:3625-36 (2011)  
Target
Name:
Hypoxia-inducible factor 1-alpha inhibitor
Synonyms:
FIH1 HIF1N_HUMAN Hypoxia-inducible factor 1-alpha inhibitor
Type:
Enzyme
Mol. Mass.:
40278.92
Organism:
Homo sapiens (Human)
Description:
Q9NWT6
Residue:
349
  
Inhibitor
Name:
BDBM26108
Synonyms:
(2R)-2-(formamidoformic acid)-4-phenylbutanoic acid | N-Oxalyl-D-homophenylalanine, 1c
Type:
Small organic molecule
Emp. Form.:
C12H13NO5
Mol. Mass.:
251.2353
SMILES:
OC(=O)[C@@H](CCc1ccccc1)NC(=O)C(O)=O
: