Target
Lysine-specific demethylase 4E
Ligand
BDBM50306581
Substrate
Meas. Tech.
ChEMBL_754090 (CHEMBL1798568)
IC50
5000±n/a nM
Citation
 Lohse, BKristensen, JLKristensen, LHAgger, KHelin, KGajhede, MClausen, RP Inhibitors of histone demethylases. Bioorg Med Chem 19:3625-36 (2011)  
Target
Name:
Lysine-specific demethylase 4E
Synonyms:
2-OG-Dependent Histone Demethylase JMJD2E Jumonji domain-containing protein 2E (JMJD2E) KDM4DL KDM4E_HUMAN Lysine-specific demethylase 4E | Lysine-specific demethylase 4E (KDM4E)
Type:
Enzyme
Mol. Mass.:
56815.71
Organism:
Homo sapiens (Human)
Description:
B2RXH2
Residue:
506
  
Inhibitor
Name:
BDBM50306581
Synonyms:
(R)-3-(4-(4-tert-butylphenylsulfonyloxy)phenyl)-2-(carboxyformamido)propanoic acid | CHEMBL600221
Type:
Small organic molecule
Emp. Form.:
C21H23NO8S
Mol. Mass.:
449.474
SMILES:
CC(C)(C)c1ccc(cc1)S(=O)(=O)Oc1ccc(C[C@@H](NC(=O)C(O)=O)C(O)=O)cc1
: