Target
L-cysteine:1D-myo-inositol 2-amino-2-deoxy-alpha-D-glucopyranoside ligase
Ligand
BDBM50347254
Substrate
Meas. Tech.
ChEMBL_754210 (CHEMBL1798854)
IC50
2300000±n/a nM
Citation
 Newton, GLBuchmeier, NLa Clair, JJFahey, RC Evaluation of NTF1836 as an inhibitor of the mycothiol biosynthetic enzyme MshC in growing and non-replicating Mycobacterium tuberculosis. Bioorg Med Chem 19:3956-64 (2011)  
Target
Name:
L-cysteine:1D-myo-inositol 2-amino-2-deoxy-alpha-D-glucopyranoside ligase
Synonyms:
L-Cys:GlcN-Ins ligase MSHC_MYCTU cysS2 | mshC
Type:
PROTEIN
Mol. Mass.:
45583.42
Organism:
Mycobacterium tuberculosis
Description:
ChEMBL_754210
Residue:
414
  
Inhibitor
Name:
BDBM50347254
Synonyms:
CHEMBL1796108
Type:
Small organic molecule
Emp. Form.:
C31H34ClN3O4S
Mol. Mass.:
580.137
SMILES:
CC1CC(C)CN(CCCNC(=O)c2ccc3c(c2)N(Cc2cccc(Cl)c2)C(=O)c2ccccc2S3(=O)=O)C1
: