Target
Polyunsaturated fatty acid lipoxygenase ALOX15
Ligand
BDBM50347326
Substrate
Meas. Tech.
ChEMBL_754315 (CHEMBL1799091)
IC50
5.3±n/a nM
Citation
 Ngu, KWeinstein, DSLiu, WLangevine, CCombs, DWZhuang, SChen, XMadsen, CSHarper, TWAhmad, SRobl, JA Pyrazole-based sulfonamide and sulfamides as potent inhibitors of mammalian 15-lipoxygenase. Bioorg Med Chem Lett 21:4141-5 (2011)  
Target
Name:
Polyunsaturated fatty acid lipoxygenase ALOX15
Synonyms:
15-Lipoxygenase Arachidonate 15-lipoxygenase LOX15_RABIT | Omega-6 lipoxygenase
Type:
Enzyme
Mol. Mass.:
75309.71
Organism:
Oryctolagus cuniculus (rabbit)
Description:
15-LO enzyme was purified from phenylhydrazine treated rabbits.
Residue:
663
  
Inhibitor
Name:
BDBM50347326
Synonyms:
CHEMBL1796848
Type:
Small organic molecule
Emp. Form.:
C27H33N7O2S2
Mol. Mass.:
551.727
SMILES:
CCN([C@@H]1CCN(C1)[C@H](C)c1ccccc1)S(=O)(=O)NCCc1c(n[nH]c1-c1cccs1)-c1cnccn1
: