Target
Polyunsaturated fatty acid lipoxygenase ALOX15
Ligand
BDBM50347330
Substrate
Meas. Tech.
ChEMBL_754314 (CHEMBL1799090)
IC50
15±n/a nM
Citation
 Ngu, KWeinstein, DSLiu, WLangevine, CCombs, DWZhuang, SChen, XMadsen, CSHarper, TWAhmad, SRobl, JA Pyrazole-based sulfonamide and sulfamides as potent inhibitors of mammalian 15-lipoxygenase. Bioorg Med Chem Lett 21:4141-5 (2011)  
Target
Name:
Polyunsaturated fatty acid lipoxygenase ALOX15
Synonyms:
15-Lipoxygenase Arachidonate 15-lipoxygenase LOX15_RABIT | Omega-6 lipoxygenase
Type:
Enzyme
Mol. Mass.:
75309.71
Organism:
Oryctolagus cuniculus (rabbit)
Description:
15-LO enzyme was purified from phenylhydrazine treated rabbits.
Residue:
663
  
Inhibitor
Name:
BDBM50347330
Synonyms:
CHEMBL1795361
Type:
Small organic molecule
Emp. Form.:
C25H30N6O3S2
Mol. Mass.:
526.674
SMILES:
CN([C@@H]1CCN(Cc2ccccc2)C1)S(=O)(=O)NCCc1c(n[nH]c1-c1cccs1)-c1cc(C)on1
: