Target
cAMP-specific 3',5'-cyclic phosphodiesterase 4A
Ligand
BDBM50347339
Substrate
Meas. Tech.
ChEMBL_755117 (CHEMBL1805697)
IC50
0.55±n/a nM
Citation
 Gallant, MAspiotis, RDay, SDias, RDubé, DDubé, LFriesen, RWGirard, MGuay, DHamel, PHuang, ZLacombe, PLaliberté, SLévesque, JFLiu, SMacdonald, DMancini, JNicholson, DWStyhler, ATownson, KWaters, KYoung, RNGirard, Y Discovery of MK-0952, a selective PDE4 inhibitor for the treatment of long-term memory loss and mild cognitive impairment. Bioorg Med Chem Lett 20:6387-93 (2010)  
Target
Name:
cAMP-specific 3',5'-cyclic phosphodiesterase 4A
Synonyms:
3',5'-cyclic phosphodiesterase PDE46 PDE4A_HUMAN Phosphodiesterase 4A | Phosphodiesterase 4A (PDE4)
Type:
Enzyme
Mol. Mass.:
98113.27
Organism:
Homo sapiens (Human)
Description:
P27815
Residue:
886
  
Inhibitor
Name:
BDBM50347339
Synonyms:
CHEMBL1801151
Type:
Small organic molecule
Emp. Form.:
C28H23N7O2
Mol. Mass.:
489.5279
SMILES:
O=C(NC1CC1)c1cn(-c2cccc(c2)-c2ccc(cc2)C2CC2c2nnn[nH]2)c2ncccc2c1=O
: