Target
Nuclear receptor subfamily 1 group I member 2
Ligand
BDBM50347620
Substrate
Meas. Tech.
ChEMBL_756760 (CHEMBL1805306)
EC50
2200±n/a nM
Citation
 Sepe, VUmmarino, RD'Auria, MVMencarelli, AD'Amore, CRenga, BZampella, AFiorucci, S Total synthesis and pharmacological characterization of solomonsterol A, a potent marine pregnane-X-receptor agonist endowed with anti-inflammatory activity. J Med Chem 54:4590-9 (2011)  
Target
Name:
Nuclear receptor subfamily 1 group I member 2
Synonyms:
NR1I2 Orphan nuclear receptor PAR1 PXR SXR nuclear receptor subfamily 1 group I member 2 isoform 1
Type:
Nuclear receptor
Mol. Mass.:
49774.77
Organism:
Homo sapiens (Human)
Description:
O75469
Residue:
434
  
Inhibitor
Name:
BDBM50347620
Synonyms:
RIFAXIMIN Rifaxidin
Type:
Small organic molecule
Emp. Form.:
C43H51N3O11
Mol. Mass.:
785.8785
SMILES:
CO[C@H]1\C=C\O[C@@]2(C)Oc3c(C2=O)c2c4nc5cc(C)ccn5c4c(NC(=O)\C(C)=C/C=C/[C@H](C)[C@H](O)[C@@H](C)[C@@H](O)[C@@H](C)[C@H](OC(C)=O)[C@@H]1C)c(O)c2c(O)c3C
: