Target
Interferon-induced, double-stranded RNA-activated protein kinase
Ligand
BDBM50262685
Substrate
Meas. Tech.
ChEMBL_756675 (CHEMBL1805140)
IC50
16000±n/a nM
Citation
 Bryk, RWu, KRaimundo, BCBoardman, PEChao, PConn, GLAnderson, ECole, JLDuffy, NPNathan, CGriffin, JH Identification of new inhibitors of protein kinase R guided by statistical modeling. Bioorg Med Chem Lett 21:4108-14 (2011)  
Target
Name:
Interferon-induced, double-stranded RNA-activated protein kinase
Synonyms:
E2AK2_HUMAN Eukaryotic translation initiation factor 2-alpha kinase 2 P1/eIF-2A protein kinase PRKR Protein kinase RNA-activated eIF-2A protein kinase 2 | p68 kinase
Type:
PROTEIN
Mol. Mass.:
62104.61
Organism:
Homo sapiens (Human)
Description:
ChEMBL_1467743
Residue:
551
  
Inhibitor
Name:
BDBM50262685
Synonyms:
6-(4-(2-(piperidin-1-yl)ethoxy)phenyl)-3-(pyridin-4-yl)pyrazolo[1,5-a]pyrimidine CHEMBL478629 US9040694, Dorsomorphin
Type:
Small organic molecule
Emp. Form.:
C24H25N5O
Mol. Mass.:
399.4882
SMILES:
C(CN1CCCCC1)Oc1ccc(cc1)-c1cnc2c(cnn2c1)-c1ccncc1
: