Target
Matrix metalloproteinase-9
Ligand
BDBM50348656
Substrate
Meas. Tech.
ChEMBL_754463 (CHEMBL1806088)
IC50
0.100000±n/a nM
Citation
 Becker, DPBarta, TEBedell, LJBoehm, TLBond, BRCarroll, JCarron, CPDecrescenzo, GAEaston, AMFreskos, JNFunckes-Shippy, CLHeron, MHockerman, SHoward, CPKiefer, JRLi, MHMathis, KJMcDonald, JJMehta, PPMunie, GESunyer, TSwearingen, CAVillamil, CIWelsch, DWilliams, JMYu, YYao, J Orally active MMP-1 sparinga-tetrahydropyranyl anda-piperidinyl sulfone matrix metalloproteinase (MMP) inhibitors with efficacy in cancer, arthritis, and cardiovascular disease. J Med Chem 53:6653-80 (2010)  
Target
Name:
Matrix metalloproteinase-9
Synonyms:
67 kDa matrix metalloproteinase-9 92 kDa gelatinase CLG4B Gelatinase B MMP9 Matrix metalloproteinase 9 (MMP-9) Matrix metalloproteinase-9 (MMP9)
Type:
Enzyme
Mol. Mass.:
78452.28
Organism:
Homo sapiens (Human)
Description:
P14780
Residue:
707
  
Inhibitor
Name:
BDBM50348656
Synonyms:
CHEMBL1800089
Type:
Small organic molecule
Emp. Form.:
C25H30F3N3O6S
Mol. Mass.:
557.582
SMILES:
ONC(=O)C1(CCN(CCN2CCOCC2)CC1)S(=O)(=O)c1ccc(Oc2ccc(cc2)C(F)(F)F)cc1
: