Target
Polyunsaturated fatty acid lipoxygenase ALOX15
Ligand
BDBM32147
Substrate
Meas. Tech.
ChEMBL_761395 (CHEMBL1817025)
IC50
2400±n/a nM
Citation
 Kenyon, VRai, GJadhav, ASchultz, LArmstrong, MJameson, JBPerry, SJoshi, NBougie, JMLeister, WTaylor-Fishwick, DANadler, JLHolinstat, MSimeonov, AMaloney, DJHolman, TR Discovery of potent and selective inhibitors of human platelet-type 12- lipoxygenase. J Med Chem 54:5485-97 (2011)  
Target
Name:
Polyunsaturated fatty acid lipoxygenase ALOX15
Synonyms:
15-Lipoxygenase-1 (15-LOX-1) Arachidonate 15-lipoxygenase LOG15 Reticulocyte 15-lipoxygenase-1 | Sphingosine 1-phosphate receptor 1 (S1P1)
Type:
Protein
Mol. Mass.:
74804.05
Organism:
Homo sapiens (Human)
Description:
Residue:
662
  
Inhibitor
Name:
BDBM32147
Synonyms:
AS-229 cid_2722
Type:
Small organic molecule
Emp. Form.:
C9H5Cl2NO
Mol. Mass.:
214.048
SMILES:
Oc1c(Cl)cc(Cl)c2cccnc12
: