Target
Polyunsaturated fatty acid lipoxygenase ALOX15B
Ligand
BDBM32147
Substrate
Meas. Tech.
ChEMBL_761396 (CHEMBL1817026)
IC50
28000±n/a nM
Citation
 Kenyon, VRai, GJadhav, ASchultz, LArmstrong, MJameson, JBPerry, SJoshi, NBougie, JMLeister, WTaylor-Fishwick, DANadler, JLHolinstat, MSimeonov, AMaloney, DJHolman, TR Discovery of potent and selective inhibitors of human platelet-type 12- lipoxygenase. J Med Chem 54:5485-97 (2011)  
Target
Name:
Polyunsaturated fatty acid lipoxygenase ALOX15B
Synonyms:
15-LOX-2 15-Lipoxygenase-2 (15-LOX-2) ALOX15B Arachidonate 15-lipoxygenase, type II Epithelial 15-lipoxygenase-2 | LX15B_HUMAN
Type:
Protein
Mol. Mass.:
75850.40
Organism:
Homo sapiens (Human)
Description:
Residue:
676
  
Inhibitor
Name:
BDBM32147
Synonyms:
AS-229 cid_2722
Type:
Small organic molecule
Emp. Form.:
C9H5Cl2NO
Mol. Mass.:
214.048
SMILES:
Oc1c(Cl)cc(Cl)c2cccnc12
: