Target
Cannabinoid receptor 1
Ligand
BDBM21278
Substrate
Meas. Tech.
ChEMBL_762512 (CHEMBL1816969)
pH
7.4±n/a
IC50
18±n/a nM
Comments
extracted
Citation
 Sasmal, PKTalwar, RSwetha, JBalasubrahmanyam, DVenkatesham, BRawoof, KANeelima Devi, BJadhav, VPKhan, SKMohan, PSrinivasa Reddy, DNyavanandi, VKNanduri, SShiva Kumar, KKannan, MSrinivas, PNadipalli, PChaudhury, HSebastian, VJ Structure-activity relationship studies of novel pyrazole and imidazole carboxamides as cannabinoid-1 (CB1) antagonists. Bioorg Med Chem Lett 21:4913-8 (2011)  
Target
Name:
Cannabinoid receptor 1
Synonyms:
Brain-type cannabinoid receptor CB-R CNR1_RAT Cannabinoid receptor Cnr1 | Skr6
Type:
G Protein-Coupled Receptor (GPCR)
Mol. Mass.:
52856.55
Organism:
Rattus norvegicus (rat)
Description:
P20272
Residue:
473
  
Inhibitor
Name:
BDBM21278
Synonyms:
5-(4-chlorophenyl)-1-(2,4-dichlorophenyl)-4-methyl-N-(piperidin-1-yl)-1H-pyrazole-3-carboxamide CHEMBL111 RIMONABANT HYDROCHLORIDE SR 141716A SR141716A [3H]SR141716A
Type:
Small organic molecule
Emp. Form.:
C22H21Cl3N4O
Mol. Mass.:
463.787
SMILES:
Cc1c(nn(c1-c1ccc(Cl)cc1)-c1ccc(Cl)cc1Cl)C(=O)NN1CCCCC1
: