Target
Phospho-2-dehydro-3-deoxyheptonate aldolase, Phe-sensitive
Ligand
BDBM50350727
Substrate
Meas. Tech.
ChEMBL_762857 (CHEMBL1820674)
Ki
3600±n/a nM
Citation
 Walker, SRJiao, WParker, EJ Synthesis and evaluation of dual site inhibitors of 3-deoxy-D-arabino-heptulosonate 7-phosphate synthase. Bioorg Med Chem Lett 21:5092-7 (2011)  
Target
Name:
Phospho-2-dehydro-3-deoxyheptonate aldolase, Phe-sensitive
Synonyms:
3-deoxy-D-arabino-heptulosonate 7-phosphate synthase, Phe-sensitive aroG
Type:
PROTEIN
Mol. Mass.:
38009.60
Organism:
Escherichia coli (strain K12)
Description:
ChEMBL_762857
Residue:
350
  
Inhibitor
Name:
BDBM50350727
Synonyms:
CHEMBL1818159
Type:
Small organic molecule
Emp. Form.:
C8H14BrO5P
Mol. Mass.:
301.072
SMILES:
OC(=O)C(CCCCCBr)=CP(O)(O)=O
: