Target
Kappa-type opioid receptor
Ligand
BDBM50350960
Substrate
Meas. Tech.
ChEMBL_763652 (CHEMBL1820178)
Ki
10±n/a nM
Citation
 Verhoest, PRBasak, ASParikh, VHayward, MKauffman, GWParadis, VMcHardy, SFMcLean, SGrimwood, SSchmidt, AWVanase-Frawley, MFreeman, JVan Deusen, JCox, LWong, DLiras, S Design and discovery of a selective small molecule¿ opioid antagonist (2-methyl-N-((2'-(pyrrolidin-1-ylsulfonyl)biphenyl-4-yl)methyl)propan-1-amine, PF-4455242). J Med Chem 54:5868-77 (2011)  
Target
Name:
Kappa-type opioid receptor
Synonyms:
K-OR-1 Kappa-opioid receptor (KOR) Kappa-type opioid receptor (KOR) OPIATE Kappa OPRK1 kappa opioid receptor (KOR)
Type:
G Protein-Coupled Receptor (GPCR)
Mol. Mass.:
42648.76
Organism:
Homo sapiens (Human)
Description:
P41145
Residue:
380
  
Inhibitor
Name:
BDBM50350960
Synonyms:
CHEMBL1818324
Type:
Small organic molecule
Emp. Form.:
C22H29FN2O3S
Mol. Mass.:
420.541
SMILES:
CC(C)CNCc1ccc(cc1F)-c1ccccc1S(=O)(=O)N1CCOC[C@H]1C
: