Target
Histone-lysine N-methyltransferase EHMT2
Ligand
BDBM50353132
Substrate
Meas. Tech.
ChEMBL_768510 (CHEMBL1832333)
IC50
24±n/a nM
Citation
 Liu, FBarsyte-Lovejoy, DAllali-Hassani, AHe, YHerold, JMChen, XYates, CMFrye, SVBrown, PJHuang, JVedadi, MArrowsmith, CHJin, J Optimization of cellular activity of G9a inhibitors 7-aminoalkoxy-quinazolines. J Med Chem 54:6139-50 (2011)  
Target
Name:
Histone-lysine N-methyltransferase EHMT2
Synonyms:
BAT8 EHMT2 G9A Histone-lysine N-methyltransferase EHMT1/EHMT2 KMT1C Protein G9a (G9a)
Type:
Enzyme
Mol. Mass.:
132339.87
Organism:
Homo sapiens (Human)
Description:
Q96KQ7
Residue:
1210
  
Inhibitor
Name:
BDBM50353132
Synonyms:
CHEMBL1829305
Type:
Small organic molecule
Emp. Form.:
C37H61N7O2
Mol. Mass.:
635.9259
SMILES:
COc1cc2c(NC3CCN(CC4CCCCC4)CC3)nc(nc2cc1OCCCN1CCCCC1)N1CCCN(CC1)C(C)C
: