Target
ATP-dependent translocase ABCB1
Ligand
BDBM50353597
Substrate
Meas. Tech.
ChEMBL_769544 (CHEMBL1833291)
Ki
340±n/a nM
Citation
 Perestelo, NRSánchez-Cañete, MPGamarro, FJiménez, IACastanys, SBazzocchi, IL Overcoming human P-glycoprotein-dependent multidrug resistance with novel dihydro-ß-agarofuran sesquiterpenes. Eur J Med Chem 46:4915-23 (2011)  
Target
Name:
ATP-dependent translocase ABCB1
Synonyms:
ABCB1 MDR1_HUMAN Multidrug resistance protein 1 P-glycoprotein (P-gp) PGY1
Type:
Protein
Mol. Mass.:
141503.50
Organism:
Homo sapiens (Human)
Description:
P08183
Residue:
1280
  
Inhibitor
Name:
BDBM50353597
Synonyms:
CHEMBL1829396
Type:
Small organic molecule
Emp. Form.:
C38H40O13
Mol. Mass.:
704.7164
SMILES:
CC(=O)OC[C@]12[C@H](C[C@@H]3[C@@H](OC(=O)c4ccccc4)[C@]1(OC3(C)C)[C@@](C)(O)C[C@H](OC(=O)c1ccccc1)[C@@H]2OC(C)=O)OC(=O)c1ccoc1
: