Target
cAMP-specific 3',5'-cyclic phosphodiesterase 4D
Ligand
BDBM50353706
Substrate
Meas. Tech.
ChEMBL_769285 (CHEMBL1833212)
IC50
0.5±n/a nM
Citation
 Taltavull, JSerrat, JGràcia, JGavaldà, ACórdoba, MCalama, EMontero, JLAndrés, MMiralpeix, MVilella, DHernández, BBeleta, JRyder, HPagès, L Synthesis and biological activity of pyrido[3',2':4,5]furo[3,2-d]pyrimidine derivatives as novel and potent phosphodiesterase type 4 inhibitors. Eur J Med Chem 46:4946-56 (2011)  
Target
Name:
cAMP-specific 3',5'-cyclic phosphodiesterase 4D
Synonyms:
3',5'-cyclic phosphodiesterase PDE43 PDE4D_HUMAN | Phosphodiesterase 4D
Type:
Protein
Mol. Mass.:
91092.69
Organism:
Homo sapiens (Human)
Description:
Q08499
Residue:
809
  
Inhibitor
Name:
BDBM50353706
Synonyms:
CHEMBL1828652
Type:
Small organic molecule
Emp. Form.:
C24H28N6O
Mol. Mass.:
416.5187
SMILES:
CC(C)Nc1nc2oc3c(NCc4cccnc4)ncnc3c2c2CC(C)(C)CCc12
: