Target
Kinesin-1 heavy chain
Ligand
BDBM50353788
Substrate
Meas. Tech.
ChEMBL_770435 (CHEMBL1833744)
IC50
>100000±n/a nM
Citation
 Theoclitou, MEAquila, BBlock, MHBrassil, PJCastriotta, LCode, ECollins, MPDavies, AMDeegan, TEzhuthachan, JFilla, SFreed, EHu, HHuszar, DJayaraman, MLawson, DLewis, PMNadella, MVOza, VPadmanilayam, MPontz, TRonco, LRussell, DWhitston, DZheng, X Discovery of (+)-N-(3-aminopropyl)-N-[1-(5-benzyl-3-methyl-4-oxo-[1,2]thiazolo[5,4-d]pyrimidin-6-yl)-2-methylpropyl]-4-methylbenzamide (AZD4877), a kinesin spindle protein inhibitor and potential anticancer agent. J Med Chem 54:6734-50 (2011)  
Target
Name:
Kinesin-1 heavy chain
Synonyms:
KIF5B KNS | KNS1
Type:
PROTEIN
Mol. Mass.:
109682.61
Organism:
Homo sapiens (Human)
Description:
ChEMBL_770435
Residue:
963
  
Inhibitor
Name:
BDBM50353788
Synonyms:
CHEMBL1829433
Type:
Small organic molecule
Emp. Form.:
C28H33N5O2S
Mol. Mass.:
503.659
SMILES:
CC(C)C(N(CCCN)C(=O)c1ccc(C)cc1)c1nc2snc(C)c2c(=O)n1Cc1ccccc1
: