Target
4-diphosphocytidyl-2-C-methyl-D-erythritol kinase
Ligand
BDBM50283498
Substrate
Meas. Tech.
ChEMBL_772123 (CHEMBL1838042)
IC50
12000±n/a nM
Citation
 Tang, MOdejinmi, SIAllette, YMVankayalapati, HLai, K Identification of novel small molecule inhibitors of 4-diphosphocytidyl-2-C-methyl-D-erythritol (CDP-ME) kinase of Gram-negative bacteria. Bioorg Med Chem 19:5886-95 (2011)  
Target
Name:
4-diphosphocytidyl-2-C-methyl-D-erythritol kinase
Synonyms:
4-(cytidine-5'-diphospho)-2-C-methyl-D-erythritol kinase ISPE_YERPE ispE
Type:
PROTEIN
Mol. Mass.:
32675.02
Organism:
Yersinia pestis
Description:
ChEMBL_772123
Residue:
299
  
Inhibitor
Name:
BDBM50283498
Synonyms:
4-[1-Furan-2-yl-meth-(Z)-ylidene]-3-phenyl-4H-isoxazol-5-one cid_1834885
Type:
Small organic molecule
Emp. Form.:
C14H9NO3
Mol. Mass.:
239.2262
SMILES:
O=C1ON=C(\C1=C\c1ccco1)c1ccccc1
: