Target
4-diphosphocytidyl-2-C-methyl-D-erythritol kinase
Ligand
BDBM50355116
Substrate
Meas. Tech.
ChEMBL_772123 (CHEMBL1838042)
IC50
9000±n/a nM
Citation
 Tang, MOdejinmi, SIAllette, YMVankayalapati, HLai, K Identification of novel small molecule inhibitors of 4-diphosphocytidyl-2-C-methyl-D-erythritol (CDP-ME) kinase of Gram-negative bacteria. Bioorg Med Chem 19:5886-95 (2011)  
Target
Name:
4-diphosphocytidyl-2-C-methyl-D-erythritol kinase
Synonyms:
4-(cytidine-5'-diphospho)-2-C-methyl-D-erythritol kinase ISPE_YERPE ispE
Type:
PROTEIN
Mol. Mass.:
32675.02
Organism:
Yersinia pestis
Description:
ChEMBL_772123
Residue:
299
  
Inhibitor
Name:
BDBM50355116
Synonyms:
CHEMBL493923 US11337935, Compound 22
Type:
Small organic molecule
Emp. Form.:
C18H14N2O2S2
Mol. Mass.:
354.446
SMILES:
Oc1ccccc1C1NC(=O)C(C#N)=C(SCc2ccccc2)S1
: