Target
UDP-glucuronosyltransferase 1A7
Ligand
BDBM50206509
Substrate
Meas. Tech.
ChEMBL_774123 (CHEMBL1908128)
Ki
96000±n/a nM
Citation
 Kiang, TKEnsom, MHChang, TK UDP-glucuronosyltransferases and clinical drug-drug interactions. Pharmacol Ther 106:97-132 (2005)  
Target
Name:
UDP-glucuronosyltransferase 1A7
Synonyms:
GNT1 UDP-glucuronosyltransferase 1-7 UDP-glucuronosyltransferase 1A7 UGT-1G UGT1*7 UGT1.7 UGT1G
Type:
PROTEIN
Mol. Mass.:
59829.76
Organism:
Homo sapiens (Human)
Description:
ChEMBL_1489264
Residue:
530
  
Inhibitor
Name:
BDBM50206509
Synonyms:
4-Dipropylsulfamoyl-benzoic acid 4-Dipropylsulfamoyl-benzoic acid(probenecid) CHEMBL897 Probalan
Type:
Small organic molecule
Emp. Form.:
C13H19NO4S
Mol. Mass.:
285.359
SMILES:
CCCN(CCC)S(=O)(=O)c1ccc(cc1)C(O)=O
: