Target
Bone morphogenetic protein receptor type-1A
Ligand
BDBM15138
Substrate
Meas. Tech.
ChEMBL_774425 (CHEMBL1908642)
Kd
>10000±n/a nM
Citation
 Davis, MIHunt, JPHerrgard, SCiceri, PWodicka, LMPallares, GHocker, MTreiber, DKZarrinkar, PP Comprehensive analysis of kinase inhibitor selectivity. Nat Biotechnol 29:1046-51 (2011)  
Target
Name:
Bone morphogenetic protein receptor type-1A
Synonyms:
ACVRLK3 Activin receptor-like kinase 3 (ALK-3) BMR1A_HUMAN
Type:
Enzyme
Mol. Mass.:
60204.46
Organism:
Homo sapiens (Human)
Description:
P36894
Residue:
532
  
Inhibitor
Name:
BDBM15138
Synonyms:
5-indazolyl pyridine 11g A-674563 indazole-pyridine, 7
Type:
Small organic molecule
Emp. Form.:
C22H22N4O
Mol. Mass.:
358.4363
SMILES:
Cc1n[nH]c2ccc(cc12)-c1cncc(OC[C@@H](N)Cc2ccccc2)c1
: