Target
Serine/threonine-protein kinase PknB
Ligand
BDBM50355501
Substrate
Meas. Tech.
ChEMBL_774233 (CHEMBL1908450)
Kd
4200±n/a nM
Citation
 Davis, MIHunt, JPHerrgard, SCiceri, PWodicka, LMPallares, GHocker, MTreiber, DKZarrinkar, PP Comprehensive analysis of kinase inhibitor selectivity. Nat Biotechnol 29:1046-51 (2011)  
Target
Name:
Serine/threonine-protein kinase PknB
Synonyms:
PKNB_MYCTU | pknB
Type:
PROTEIN
Mol. Mass.:
66497.93
Organism:
Mycobacterium tuberculosis
Description:
ChEMBL_774233
Residue:
626
  
Inhibitor
Name:
BDBM50355501
Synonyms:
INCB-018424 RUXOLITINIB PHOSPHATE US10766894, Compound TABLE 1.1 US11203595, TABLE 1.1 | US11279703, TABLE 6.147
Type:
Small organic molecule
Emp. Form.:
C17H18N6
Mol. Mass.:
306.365
SMILES:
N#CC[C@H](C1CCCC1)n1cc(cn1)-c1ncnc2[nH]ccc12
: