Target
Programmed cell death protein 4
Ligand
BDBM50000298
Substrate
Meas. Tech.
ChEMBL_776474 (CHEMBL1913571)
IC50
880±n/a nM
Citation
 Zhao, LXHuang, SXTang, SKJiang, CLDuan, YBeutler, JAHenrich, CJMcMahon, JBSchmid, TBlees, JSColburn, NHRajski, SRShen, B Actinopolysporins A-C and tubercidin as a Pdcd4 stabilizer from the halophilic actinomycete Actinopolyspora erythraea YIM 90600. J Nat Prod 74:1990-5 (2011)  
Target
Name:
Programmed cell death protein 4
Synonyms:
H731 Nuclear antigen H731-like PDCD4_HUMAN | Protein 197/15a
Type:
PROTEIN
Mol. Mass.:
51720.55
Organism:
Homo sapiens (Human)
Description:
ChEMBL_776474
Residue:
469
  
Inhibitor
Name:
BDBM50000298
Synonyms:
'2-(4-AMINO-PYRROLO[2,3-D]PYRIMIDIN-7-YL)-5-HYDROXYMETHYL-TETRAHYDRO-FURAN-3,4-DIOL 2-(4-Amino-pyrrolo[2,3-d]pyrimidin-7-yl)-5-hydroxymethyl-tetrahydro-furan-3,4-diol 2-(4-Amino-pyrrolo[2,3-d]pyrimidin-7-yl)-5-hydroxymethyl-tetrahydro-furan-3,4-diol(tubercidin) TUBERCIDIN | cid_6245
Type:
Small organic molecule
Emp. Form.:
C11H14N4O4
Mol. Mass.:
266.2533
SMILES:
Nc1ncnc2n(ccc12)[C@@H]1O[C@H](CO)[C@@H](O)[C@H]1O
: