Target
Androgen receptor
Ligand
BDBM50355937
Substrate
Meas. Tech.
ChEMBL_775977 (CHEMBL1912975)
EC50
95±n/a nM
Citation
 Nagata, NMiyakawa, MAmano, SFuruya, KYamamoto, NNejishima, HInoguchi, K Tetrahydroquinolines as a novel series of nonsteroidal selective androgen receptor modulators: structural requirements for better physicochemical and biological properties. Bioorg Med Chem Lett 21:6310-3 (2011)  
Target
Name:
Androgen receptor
Synonyms:
ANDR_RAT Ar Nr3c4 | androgen
Type:
Enzyme
Mol. Mass.:
98219.08
Organism:
Rattus norvegicus (Rat)
Description:
P15207
Residue:
902
  
Inhibitor
Name:
BDBM50355937
Synonyms:
CHEMBL1910406
Type:
Small organic molecule
Emp. Form.:
C16H22N2O4
Mol. Mass.:
306.3569
SMILES:
CC(C)(CO)[C@H]1Nc2ccc(cc2[C@H]2OCCC[C@@H]12)[N+]([O-])=O
: