Target
Muscarinic acetylcholine receptor M4
Ligand
BDBM50356969
Substrate
Meas. Tech.
ChEMBL_788049 (CHEMBL1919028)
EC50
>10000±n/a nM
Citation
 Lebois, EPDigby, GJSheffler, DJMelancon, BJTarr, JCCho, HPMiller, NRMorrison, RBridges, TMXiang, ZScott Daniels, JWood, MRConn, PJLindsley, CW Development of a highly selective, orally bioavailable and CNS penetrant M1 agonist derived from the MLPCN probe ML071. Bioorg Med Chem Lett 21:6451-5 (2011)  
Target
Name:
Muscarinic acetylcholine receptor M4
Synonyms:
ACM4_RAT Chrm-4 | Chrm4
Type:
Enzyme Catalytic Domain
Mol. Mass.:
52841.70
Organism:
RAT
Description:
Cholinergic, muscarinic M4 CHRM4 RAT::P08485
Residue:
477
  
Inhibitor
Name:
BDBM50356969
Synonyms:
CHEMBL1916226
Type:
Small organic molecule
Emp. Form.:
C20H29N3O3
Mol. Mass.:
359.4626
SMILES:
CCOC(=O)N1CCC(CC1)N1CCC[C@H](C1)NC(=O)c1ccccc1
: