Target
Proton-coupled amino acid transporter 1
Ligand
BDBM50038178
Substrate
Meas. Tech.
ChEMBL_788189 (CHEMBL1919336)
Ki
4400000±n/a nM
Citation
 Thondorf, IVoigt, VSchäfer, SGebauer, SZebisch, KLaug, LBrandsch, M Three-dimensional quantitative structure-activity relationship analyses of substrates of the human proton-coupled amino acid transporter 1 (hPAT1). Bioorg Med Chem 19:6409-18 (2011)  
Target
Name:
Proton-coupled amino acid transporter 1
Synonyms:
PAT1 S36A1_HUMAN Solute carrier family 36 member 1 | hPAT1
Type:
PROTEIN
Mol. Mass.:
53078.06
Organism:
Homo sapiens (Human)
Description:
ChEMBL_788189
Residue:
476
  
Inhibitor
Name:
BDBM50038178
Synonyms:
(+)-4-Amino-3-isoxazolidinone (R)-4-AMINO-ISOXAZOLIDIN-3-ONE D-CYCLOSERINE cycloserine
Type:
Small organic molecule
Emp. Form.:
C3H6N2O2
Mol. Mass.:
102.0919
SMILES:
N[C@@H]1CON=C1O
: