Target
cGMP-specific 3',5'-cyclic phosphodiesterase
Ligand
BDBM50357264
Substrate
Meas. Tech.
ChEMBL_788276 (CHEMBL1919539)
IC50
0.080000±n/a nM
Citation
 Hughes, ROMaddux, TJoseph Rogier, DLu, SWalker, JKJon Jacobsen, ERumsey, JMZheng, YMacinnes, ABond, BRHan, S Investigation of the pyrazinones as PDE5 inhibitors: evaluation of regioisomeric projections into the solvent region. Bioorg Med Chem Lett 21:6348-52 (2011)  
Target
Name:
cGMP-specific 3',5'-cyclic phosphodiesterase
Synonyms:
3',5'-cyclic phosphodiesterase PDE5 PDE5A_HUMAN Phosphodiesterase 5 (PDE5) Phosphodiesterase 5A (PDE5A) cGMP-specific 3',5'-cyclic phosphodiesterase
Type:
Protein
Mol. Mass.:
99975.83
Organism:
Homo sapiens (Human)
Description:
O76074
Residue:
875
  
Inhibitor
Name:
BDBM50357264
Synonyms:
CHEMBL1916291
Type:
Small organic molecule
Emp. Form.:
C24H32N6O4
Mol. Mass.:
468.5487
SMILES:
CCCOCCn1c2cc(ncc2c(NCCN2CCOCC2)nc1=O)-c1ccc(OC)nc1
: