Target
DNA (cytosine-5)-methyltransferase 1
Ligand
BDBM50009672
Substrate
Meas. Tech.
ChEMBL_788458 (CHEMBL1918223)
IC50
4000±n/a nM
Citation
 Castellano, SKuck, DViviano, MYoo, JLópez-Vallejo, FConti, PTamborini, LPinto, AMedina-Franco, JLSbardella, G Synthesis and biochemical evaluation ofd(2)-isoxazoline derivatives as DNA methyltransferase 1 inhibitors. J Med Chem 54:7663-77 (2011)  
Target
Name:
DNA (cytosine-5)-methyltransferase 1
Synonyms:
AIM CXXC9 DNA (cytosine-5)-methyltransferase 1 isoform b DNA methyltransferase HsaI DNMT1 M.HsaI | MCMT
Type:
Enzyme
Mol. Mass.:
183184.85
Organism:
Homo sapiens (Human)
Description:
P26358
Residue:
1616
  
Inhibitor
Name:
BDBM50009672
Synonyms:
AdoHcy S-(5'-adenosyl)-L-homocysteine S-[1-(adenin-9-yl)-1,5-dideoxy-beta-D-ribofuranos-5-yl]-L-homocysteine SAH US9175331, 1 | US9333217, S-Adenosyl-L-homocysteine (SAH)
Type:
Small organic molecule
Emp. Form.:
C14H20N6O5S
Mol. Mass.:
384.411
SMILES:
N[C@@H](CCSC[C@H]1O[C@H]([C@H](O)[C@@H]1O)n1cnc2c(N)ncnc12)C(O)=O
: