Target
Tyrosine-protein phosphatase non-receptor type 7
Ligand
BDBM4375
Substrate
Meas. Tech.
ChEMBL_787850 (CHEMBL1918616)
IC50
>100000±n/a nM
Citation
 Liu, DKong, GChen, QCWang, GLi, JXu, Ylin, TTian, YZhang, XYao, XFeng, GLu, ZChen, H Fatty acids as natural specific inhibitors of the proto-oncogenic protein Shp2. Bioorg Med Chem Lett 21:6833-7 (2011)  
Target
Name:
Tyrosine-protein phosphatase non-receptor type 7
Synonyms:
He-PTP Hematopoietic protein-tyrosine phosphatase (HEPTP) PTPN7 Tyrosine-protein phosphatase non-receptor type 7 | Tyrosine-protein phosphatase non-receptor type 7 (HEPTP)
Type:
Protein
Mol. Mass.:
40530.79
Organism:
Homo sapiens (Human)
Description:
P35236
Residue:
360
  
Inhibitor
Name:
BDBM4375
Synonyms:
(2E)-3-(3,4-dihydroxyphenyl)prop-2-enoic acid 3,4-Dihydroxycinnamate, XVII Caffeic acid cid_689043
Type:
Small organic molecule
Emp. Form.:
C9H8O4
Mol. Mass.:
180.1574
SMILES:
OC(=O)\C=C\c1ccc(O)c(O)c1
: