Target
Type 1 fimbrin D-mannose specific adhesin
Ligand
BDBM50357406
Substrate
Meas. Tech.
ChEMBL_788106 (CHEMBL1919133)
IC50
511±n/a nM
Citation
 Schwardt, ORabbani, SHartmann, MAbgottspon, DWittwer, MKleeb, SZalewski, ASmieško, MCutting, BErnst, B Design, synthesis and biological evaluation of mannosyl triazoles as FimH antagonists. Bioorg Med Chem 19:6454-73 (2011)  
Target
Name:
Type 1 fimbrin D-mannose specific adhesin
Synonyms:
Adhesin protein fimH fimH
Type:
PROTEIN
Mol. Mass.:
31474.61
Organism:
Escherichia coli (strain K12)
Description:
ChEMBL_1298296
Residue:
300
  
Inhibitor
Name:
BDBM50357406
Synonyms:
CHEMBL1917309
Type:
Small organic molecule
Emp. Form.:
C17H23N3O7
Mol. Mass.:
381.3804
SMILES:
COc1ccc(Cn2cc(CO[C@H]3O[C@H](CO)[C@@H](O)[C@H](O)[C@@H]3O)nn2)cc1
: