Target
Squalene synthase
Ligand
BDBM50357696
Substrate
Meas. Tech.
ChEMBL_785902 (CHEMBL1921212)
IC50
12800±n/a nM
Citation
 Matralis, ANKatselou, MGNikitakis, AKourounakis, AP Novel benzoxazine and benzothiazine derivatives as multifunctional antihyperlipidemic agents. J Med Chem 54:5583-91 (2011)  
Target
Name:
Squalene synthase
Synonyms:
FDFT_RAT Farnesyl-diphosphate farnesyltransferase SQS Squalene synthetase
Type:
PROTEIN
Mol. Mass.:
48109.41
Organism:
Rattus norvegicus
Description:
ChEMBL_1336736
Residue:
416
  
Inhibitor
Name:
BDBM50357696
Synonyms:
CHEMBL1915483
Type:
Small organic molecule
Emp. Form.:
C21H19NO2
Mol. Mass.:
317.3811
SMILES:
CN1CC(O)(Oc2ccccc12)c1ccc(cc1)-c1ccccc1
: