Target
Cytochrome P450 3A4
Ligand
BDBM55093
Substrate
Meas. Tech.
ChEMBL_789823 (CHEMBL1925084)
IC50
>30000±n/a nM
Citation
 Jones, CKEngers, DWThompson, ADField, JRBlobaum, ALLindsley, SRZhou, YGogliotti, RDJadhav, SZamorano, RBogenpohl, JSmith, YMorrison, RDaniels, JSWeaver, CDConn, PJLindsley, CWNiswender, CMHopkins, CR Discovery, synthesis, and structure-activity relationship development of a series of N-4-(2,5-dioxopyrrolidin-1-yl)phenylpicolinamides (VU0400195, ML182): characterization of a novel positive allosteric modulator of the metabotropic glutamate receptor 4 (mGlu(4)) with oral efficacy in an antiparkin J Med Chem 54:7639-47 (2011)  
Target
Name:
Cytochrome P450 3A4
Synonyms:
Albendazole monooxygenase CP3A4_HUMAN CYP3A4 CYPIIIA4 Cytochrome P450 3A4 (CYP3A4) Nifedipine oxidase Taurochenodeoxycholate 6-alpha-hydroxylase
Type:
Enzyme
Mol. Mass.:
57349.57
Organism:
Homo sapiens (Human)
Description:
Residue:
503
  
Inhibitor
Name:
BDBM55093
Synonyms:
N-[3-chloro-4-(1,3-diketo-2-azaspiro[4.5]decan-2-yl)phenyl]picolinamide N-[3-chloro-4-(1,3-dioxo-2-azaspiro[4.5]decan-2-yl)phenyl]pyridine-2-carboxamide VU0400193-3 | cid_46869951
Type:
Small organic molecule
Emp. Form.:
C21H20ClN3O3
Mol. Mass.:
397.855
SMILES:
Clc1cc(NC(=O)c2ccccn2)ccc1N1C(=O)CC2(CCCCC2)C1=O
: