Target
Cytochrome b-245 heavy chain
Ligand
BDBM50359529
Substrate
Meas. Tech.
ChEMBL_792878 (CHEMBL1931063)
Ki
1150±n/a nM
Citation
 Gaggini, FLaleu, BOrchard, MFioraso-Cartier, LCagnon, LHoungninou-Molango, SGradia, ADuboux, GMerlot, CHeitz, FSzyndralewiez, CPage, P Design, synthesis and biological activity of original pyrazolo-pyrido-diazepine, -pyrazine and -oxazine dione derivatives as novel dual Nox4/Nox1 inhibitors. Bioorg Med Chem 19:6989-99 (2011)  
Target
Name:
Cytochrome b-245 heavy chain
Synonyms:
CGD91-phox CYBB Cytochrome b-245, beta polypeptide [Homo sapiens] Heme-binding membrane glycoprotein gp91phox NADPH oxidase 2 (NOX2) Neutrophil cytochrome b 91 kDa polypeptide gp91-1 p22 phagocyte B-cytochrome
Type:
Enzyme
Mol. Mass.:
65355.82
Organism:
Homo sapiens (Human)
Description:
P04839
Residue:
570
  
Inhibitor
Name:
BDBM50359529
Synonyms:
CHEMBL1927150
Type:
Small organic molecule
Emp. Form.:
C23H20Cl2N4O2
Mol. Mass.:
455.337
SMILES:
Clc1cccc(CN2CCCn3c(C2)c2c(cc3=O)[nH]n(-c3ccccc3Cl)c2=O)c1
: