Target
Alpha-1A adrenergic receptor
Ligand
BDBM50359747
Substrate
Meas. Tech.
ChEMBL_791620 (CHEMBL1930844)
Ki
4.6±n/a nM
Citation
 Huber, DLöber, SHübner, HGmeiner, P Bivalent molecular probes for dopamine D2-like receptors. Bioorg Med Chem 20:455-66 (2011)  
Target
Name:
Alpha-1A adrenergic receptor
Synonyms:
Uncharacterized protein
Type:
PROTEIN
Mol. Mass.:
51698.80
Organism:
Sus scrofa
Description:
ChEMBL_791620
Residue:
466
  
Inhibitor
Name:
BDBM50359747
Synonyms:
CHEMBL1928130
Type:
Small organic molecule
Emp. Form.:
C58H84N6O11
Mol. Mass.:
1041.3212
SMILES:
COc1ccccc1N1CCN(CCCCNC(=O)c2ccc(COCCOCCOCCOCCOCCOCCOCc3ccc(cc3)C(=O)NCCCCN3CCN(CC3)c3ccccc3OC)cc2)CC1
: