Target
Seed linoleate 13S-lipoxygenase-1
Ligand
BDBM22372
Substrate
Meas. Tech.
ChEMBL_791246 (CHEMBL1929733)
IC50
31300±n/a nM
Citation
 Eleftheriou, PGeronikaki, AHadjipavlou-Litina, DVicini, PFilz, OFilimonov, DPoroikov, VChaudhaery, SSRoy, KKSaxena, AK Fragment-based design, docking, synthesis, biological evaluation and structure-activity relationships of 2-benzo/benzisothiazolimino-5-aryliden-4-thiazolidinones as cycloxygenase/lipoxygenase inhibitors. Eur J Med Chem 47:111-24 (2012)  
Target
Name:
Seed linoleate 13S-lipoxygenase-1
Synonyms:
15-LOX 15-lipo-oxygenase (SLO) L-1 LOX1.1 Lipoxygenase (LOX) Lipoxygenase-1 | Seed lipoxygenase-1
Type:
Enzyme
Mol. Mass.:
94365.66
Organism:
Glycine max (soybean)
Description:
Residue:
839
  
Inhibitor
Name:
BDBM22372
Synonyms:
4-[(2R,3S)-4-(3,4-dihydroxyphenyl)-2,3-dimethylbutyl]benzene-1,2-diol CHEMBL313972 NDGA | Nordihydroguaiaretic Acid
Type:
Antioxidant
Emp. Form.:
C18H22O4
Mol. Mass.:
302.3649
SMILES:
C[C@@H](Cc1ccc(O)c(O)c1)[C@H](C)Cc1ccc(O)c(O)c1
: