Target
Alpha-2A adrenergic receptor
Ligand
BDBM50016897
Substrate
Meas. Tech.
ChEMBL_793658 (CHEMBL1932426)
EC50
30±n/a nM
Citation
 Saczewski, JHudson, AScheinin, MRybczynska, AMa, DSaczewski, FLaird, SLaurila, JMBoblewski, KLehmann, AGu, JWatts, H Synthesis and biological activities of 2-[(heteroaryl)methyl]imidazolines. Bioorg Med Chem 20:108-16 (2011)  
Target
Name:
Alpha-2A adrenergic receptor
Synonyms:
ADA2A_HUMAN ADRA2R Adrenergic alpha2A Alpha-2 adrenergic receptor subtype C10 Alpha-2A adrenoreceptor alpha-2A adrenergic receptor [Homo sapiens]
Type:
Enzyme
Mol. Mass.:
48979.91
Organism:
Homo sapiens (Human)
Description:
P08913
Residue:
450
  
Inhibitor
Name:
BDBM50016897
Synonyms:
2-(2,6-dichloroanilino)-1,3-diazacyclopentene-(2) CLONIDINE clonidine (amino form)
Type:
Small organic molecule
Emp. Form.:
C9H9Cl2N3
Mol. Mass.:
230.094
SMILES:
Clc1cccc(Cl)c1\[#7]=[#6]-1\[#7]-[#6]-[#6]-[#7]-1
: